1

Resolved

Django build fails after adding django app

description

VS 2012

Create new django project
Create virtual env
Install django into it
F5 -> it will work
Add django app
F5 -> build error
------ Build started: Project: DjangoWebProject4, Configuration: Debug Any CPU ------
C:\Program Files (x86)\MSBuild\Microsoft\VisualStudio\v11.0\Python Tools\Microsoft.PythonTools.Web.targets(461,5): error MSB3491: Could not write lines to file "obj\Debug\AzureSetup.cfg". Could not find a part of the path 'c:\users\huvalo\documents\visual studio 2012\Projects\DjangoWebProject4\DjangoWebProject4\obj\Debug\AzureSetup.cfg'.
Done building project "DjangoWebProject4.pyproj" -- FAILED.

Build FAILED.
========== Build: 0 succeeded, 1 failed, 0 up-to-date, 0 skipped ==========
Press F5 again and it will work this time

comments